Categories
Linux Posts Ubuntu

Java – .jar Error 127 /bin/sh: javac: not found.

If you’re getting a similar error to this while trying to compile java files (.jar) then you’re probably missing the jdk, in ubuntu it’s called “sun-java6-jdk” so just go ahead and install that and all should be good!

make[1]: Entering directory `/home/alex/kinect/OpenNI/Platform/Linux-x86/Build/Wrappers/OpenNI.java’
javac -d Release ../../../../../Wrappers/OpenNI.java/src/org/OpenNI/*.java
/bin/sh: javac: not found
make[1]: *** [../../../Bin/Release/org.OpenNI.jar] Error 127
make[1]: Leaving directory `/home/alex/kinect/OpenNI/Platform/Linux-x86/Build/Wrappers/OpenNI.java’
make: *** [Wrappers/OpenNI.java] Error 2

FIX:

sudo apt-get install sun-java6-jdk
Categories
Arch Linux HowTo Linux Posts

Failed to build Planner-0.14.4 in Arch Linux

When trying to install Gnome Planner ( http://live.gnome.org/Planner ) in Arch Linux, I came across this error:

Error:

/usr/bin/pygobject-codegen-2.0: line 11: /usr/bin/python2: No such file or directory
make[2]: *** [planner.c] Error 127
make[2]: Leaving directory `/home/alex/Desktop/planner-0.14.4/python'
make[1]: *** [all-recursive] Error 1
make[1]: Leaving directory `/home/alex/Desktop/planner-0.14.4'
make: *** [all] Error 2

To fix this, I made a symbolic link from /usr/bin/python2.7 to /usr/bin/python2, this should work with other similar errors involving missing python2 file.

sudo ln -s /usr/bin/python2.7 /usr/bin/python2

Once you have made the made the symbolic link continue to make and install the program as usual.